texlive errors [builder-th-i486 at pld-linux.org: TEST build ERRORS: nickle.spec OK: ibus-gjs.spec]

Jakub Bogusz qboosh at pld-linux.org
Sat Nov 10 15:14:00 CET 2012

Any hints what's wrong?
Google answers are very unclear.

It failed on th-i[46]86, built successfully on th-x86_64 and my i686

----- Forwarded message from PLD th-i486 builder <builder-th-i486 at pld-linux.org> -----

docbook2pdf nickle-tutorial.sgml
Using catalogs: /etc/sgml/catalog
Using stylesheet: /usr/share/sgml/docbook/utils-0.6.14/docbook-utils.dsl#print
Working on: /tmp/B.986ad46e-05bc-4d8a-984a-56321f8fa400/BUILD/nickle-2.77/doc/tutorial/nickle-tutorial.sgml
This is pdfTeXk, Version 3.1415926-1.40.9 (Web2C 7.5.7)
 %&-line parsing enabled.
entering extended mode

JadeTeX 2002/01/25: 3.12
Elements will be labelled
Jade begin document sequence at 21
No file nickle-tutorial.aux.
No file T2Acmr.fd.

! LaTeX Error: This NFSS system isn't set up properly.

See the LaTeX manual or LaTeX Companion for explanation.
Type  H <return>  for immediate help.
Transcript written on nickle-tutorial.log.
make[3]: *** [nickle-tutorial.pdf] Error 9
make[3]: Leaving directory `/tmp/B.986ad46e-05bc-4d8a-984a-56321f8fa400/BUILD/nickle-2.77/doc/tutorial'
make[2]: *** [all-recursive] Error 1
make[2]: Leaving directory `/tmp/B.986ad46e-05bc-4d8a-984a-56321f8fa400/BUILD/nickle-2.77/doc'
make[1]: *** [all-recursive] Error 1
make[1]: Leaving directory `/tmp/B.986ad46e-05bc-4d8a-984a-56321f8fa400/BUILD/nickle-2.77'
make: *** [all] Error 2
error: Bad exit status from /tmp/B.986ad46e-05bc-4d8a-984a-56321f8fa400/BUILD/tmp/rpm-tmp.66362 (%build)

RPM build errors:
    Bad exit status from /tmp/B.986ad46e-05bc-4d8a-984a-56321f8fa400/BUILD/tmp/rpm-tmp.66362 (%build)
ended at: Sat Nov 10 12:10:01 2012, done in 0:00:09.842846
error: No files produced.
+ chmod -R u+rwX /tmp/B.986ad46e-05bc-4d8a-984a-56321f8fa400/BUILD
+ rm -rf /tmp/B.986ad46e-05bc-4d8a-984a-56321f8fa400/tmp /tmp/B.986ad46e-05bc-4d8a-984a-56321f8fa400/BUILD
+ rm -rf /tmp/B.986ad46e-05bc-4d8a-984a-56321f8fa400
Build-Time: user:8.11s sys:1.22s real:14.58s (faults io:35 non-io:786808)


----- End forwarded message -----

Jakub Bogusz    http://qboosh.pl/

More information about the pld-devel-en mailing list